Subject ID,DeviceID,Assessment Name,Inst,RawScore,Theta,TScore,SE,ItmCnt,DateFinished,Language,Computed Score,Uncorrected Standard Score,Age-Corrected Standard Score,National Percentile (age adjusted),Fully-Corrected T-score,Raw Score Right Ear,Threshold Right Ear,Raw Score Left Ear,Threshold Left Ear,InstrumentBreakoff,InstrumentStatus2,InstrumentRCReason,InstrumentRCReasonOther
1,949AF056-082A-4691-BF29-D7FD158E45AC,Assessment 2,NIH Toolbox Picture Vocabulary Test Age 3+ v2.0,,4.291,,0.485,26,28/02/2018 14:07,en-US,,103,100,51,48,,,,,2,3,,
1,949AF056-082A-4691-BF29-D7FD158E45AC,Assessment 2,NIH Toolbox List Sorting Working Memory Test Age 7+ v2.1,20,,,,20,28/02/2018 14:16,en-US,,113,108,69,52,,,,,2,3,,
1,949AF056-082A-4691-BF29-D7FD158E45AC,Assessment 2,NIH Toolbox Pattern Comparison Processing Speed Test Age 7+ v2.1,67,,,,67,28/02/2018 14:20,en-US,94,149,137,99,71,,,,,2,3,,
1,949AF056-082A-4691-BF29-D7FD158E45AC,Assessment 2,NIH Toolbox Picture Sequence Memory Test Age 8+ Form A v2.1,29,1.55,,0.57,6,28/02/2018 14:27,en-US,740.11,136,137,99,78,,,,,2,3,,
1,949AF056-082A-4691-BF29-D7FD158E45AC,Assessment 2,NIH Toolbox Flanker Inhibitory Control and Attention Test Age 12+ v2.1,20,,,,24,28/02/2018 14:30,en-US,9.71,114,115,84,57,,,,,2,3,,
1,949AF056-082A-4691-BF29-D7FD158E45AC,Assessment 2,NIH Toolbox Dimensional Change Card Sort Test Age 12+ v2.1,30,,,,38,28/02/2018 14:35,en-US,9.94,120,125,96,63,,,,,2,3,,
1,949AF056-082A-4691-BF29-D7FD158E45AC,Assessment 2,NIH Toolbox Oral Symbol Digit Test 8+,138,,,,144,28/02/2018 14:39,en-US,,,,,,,,,,2,3,,
1,949AF056-082A-4691-BF29-D7FD158E45AC,Assessment 2,NIH Toolbox Auditory Verbal Learning Test (Rey) 8+ v2.0,38,,,,4,28/02/2018 14:43,en-US,,,,,,,,,,2,3,,
1,949AF056-082A-4691-BF29-D7FD158E45AC,Assessment 2,NIH Toolbox Positive Affect CAT Age 18+ v2.0,13,-0.641,43,3,4,28/02/2018 14:44,en-US,,,,,,,,,,2,3,,
1,949AF056-082A-4691-BF29-D7FD158E45AC,Assessment 2,NIH Toolbox General Life Satisfaction CAT Age 18+ v2.0,19,0.198,51,3,4,28/02/2018 14:44,en-US,,,,,,,,,,2,3,,
1,949AF056-082A-4691-BF29-D7FD158E45AC,Assessment 2,NIH Toolbox Meaning and Purpose CAT Age 18+ v2.0,16,-0.753,41,3,5,28/02/2018 14:45,en-US,,,,,,,,,,2,3,,
1,949AF056-082A-4691-BF29-D7FD158E45AC,Assessment 2,NIH Toolbox Emotional Support FF Age 18+ v2.0,35,-0.201,47,2,8,28/02/2018 14:45,en-US,,,,,,,,,,2,3,,
1,949AF056-082A-4691-BF29-D7FD158E45AC,Assessment 2,NIH Toolbox Instrumental Support FF Age 18+ v2.0,27,-0.673,43,2,8,28/02/2018 14:46,en-US,,,,,,,,,,2,3,,
1,949AF056-082A-4691-BF29-D7FD158E45AC,Assessment 2,NIH Toolbox Friendship FF Age 18+ v2.0,30,-0.29,47,2,8,28/02/2018 14:46,en-US,,,,,,,,,,2,3,,
1,949AF056-082A-4691-BF29-D7FD158E45AC,Assessment 2,NIH Toolbox Loneliness FF Age 18+ v2.0,16,1.588,67,3,5,28/02/2018 14:46,en-US,,,,,,,,,,2,3,,
1,949AF056-082A-4691-BF29-D7FD158E45AC,Assessment 2,NIH Toolbox Perceived Rejection FF Age 18+ v2.0,11,-0.352,47,3,8,28/02/2018 14:47,en-US,,,,,,,,,,2,3,,
1,949AF056-082A-4691-BF29-D7FD158E45AC,Assessment 2,NIH Toolbox Perceived Hostility FF Age 18+ v2.0,10,-0.862,41,3,8,28/02/2018 14:47,en-US,,,,,,,,,,2,3,,
1,949AF056-082A-4691-BF29-D7FD158E45AC,Assessment 2,NIH Toolbox Self-Efficacy CAT Age 18+ v2.0,16,-0.01,49,3,5,28/02/2018 14:48,en-US,,,,,,,,,,2,3,,
1,949AF056-082A-4691-BF29-D7FD158E45AC,Assessment 2,NIH Toolbox Perceived Stress FF Age 18+ v2.0,36,1.776,69,3,10,28/02/2018 14:48,en-US,,,,,,,,,,2,3,,
1,949AF056-082A-4691-BF29-D7FD158E45AC,Assessment 2,NIH Toolbox Fear-Affect CAT Age 18+ v2.0,11,1.165,63,3,4,28/02/2018 14:49,en-US,,,,,,,,,,2,3,,
1,949AF056-082A-4691-BF29-D7FD158E45AC,Assessment 2,NIH Toolbox Fear-Somatic Arousal FF Age 18+ v2.0,9,0.423,55,5,6,28/02/2018 14:49,en-US,,,,,,,,,,2,3,,
1,949AF056-082A-4691-BF29-D7FD158E45AC,Assessment 2,NIH Toolbox Sadness CAT Age 18+ v2.0,8,0.5,57,2,4,28/02/2018 14:49,en-US,,,,,,,,,,2,3,,
1,949AF056-082A-4691-BF29-D7FD158E45AC,Assessment 2,NIH Toolbox Anger-Affect CAT Age 18+ v2.0,15,0.967,62,3,6,28/02/2018 14:49,en-US,,,,,,,,,,2,3,,
1,949AF056-082A-4691-BF29-D7FD158E45AC,Assessment 2,NIH Toolbox Anger-Hostility FF Age 18+ v2.0,20,1.195,63,3,5,28/02/2018 14:50,en-US,,,,,,,,,,2,3,,
1,949AF056-082A-4691-BF29-D7FD158E45AC,Assessment 2,NIH Toolbox Anger-Physical Aggression FF Age 18+ v2.0,7,0.623,57,4,5,28/02/2018 14:50,en-US,,,,,,,,,,2,3,,
1,949AF056-082A-4691-BF29-D7FD158E45AC,Assessment 2,NIH Toolbox Words-In-Noise Test Age 6+ v2.1,,,,,13,28/02/2018 14:56,en-US,,,,,,24,6.8,21,9.2,2,3,,
1,949AF056-082A-4691-BF29-D7FD158E45AC,Assessment 2,Negative Affect Summary (18+),,,65,,,,en-US,,,,,,,,,,,,,
1,949AF056-082A-4691-BF29-D7FD158E45AC,Assessment 2,Social Satisfaction Summary (18+),,,43,,,,en-US,,,,,,,,,,,,,
1,949AF056-082A-4691-BF29-D7FD158E45AC,Assessment 2,Psychological Well Being Summary (18+),,,44,,,,en-US,,,,,,,,,,,,,
1,949AF056-082A-4691-BF29-D7FD158E45AC,Assessment 2,Cognition Fluid Composite v1.1,,,,,,,en-US,,135,136,99,71,,,,,,,,
1,949AF056-082A-4691-BF29-D7FD158E45AC,Assessment 2,Cognition Early Childhood Composite v1.1,,,,,,,en-US,,123,127,96,66,,,,,,,,
2,949AF056-082A-4691-BF29-D7FD158E45AC,Assessment 1,NIH Toolbox Picture Vocabulary Test Age 3+ v2.0,,1.16,,0.485,28,26/02/2018 14:04,en-US,,88,77,6,,,,,,2,3,,
2,949AF056-082A-4691-BF29-D7FD158E45AC,Assessment 1,NIH Toolbox Picture Sequence Memory Test Age 8+ Form A v2.1,28,0.81,,0.38,6,26/02/2018 14:11,en-US,666.14,124,116,86,,,,,,2,3,,
2,949AF056-082A-4691-BF29-D7FD158E45AC,Assessment 1,NIH Toolbox Dimensional Change Card Sort Test Age 12+ v2.1,30,,,,38,26/02/2018 14:16,en-US,9.43,115,115,84,,,,,,2,3,,
2,949AF056-082A-4691-BF29-D7FD158E45AC,Assessment 1,NIH Toolbox Flanker Inhibitory Control and Attention Test Age 12+ v2.1,20,,,,24,26/02/2018 14:19,en-US,8.07,98,77,6,,,,,,2,3,,
2,949AF056-082A-4691-BF29-D7FD158E45AC,Assessment 1,NIH Toolbox Pattern Comparison Processing Speed Test Age 7+ v2.1,42,,,,42,26/02/2018 14:22,en-US,53,97,82,11,,,,,,2,3,,
2,949AF056-082A-4691-BF29-D7FD158E45AC,Assessment 1,NIH Toolbox Positive Affect CAT Age 18+ v2.0,14,-0.377,46,3,4,26/02/2018 14:24,en-US,,,,,,,,,,2,3,,
2,949AF056-082A-4691-BF29-D7FD158E45AC,Assessment 1,NIH Toolbox General Life Satisfaction CAT Age 18+ v2.0,18,-0.067,49,3,4,26/02/2018 14:24,en-US,,,,,,,,,,2,3,,
2,949AF056-082A-4691-BF29-D7FD158E45AC,Assessment 1,NIH Toolbox Meaning and Purpose CAT Age 18+ v2.0,14,-1.139,37,3,5,26/02/2018 14:25,en-US,,,,,,,,,,2,3,,
2,949AF056-082A-4691-BF29-D7FD158E45AC,Assessment 1,NIH Toolbox Emotional Support FF Age 18+ v2.0,40,1.246,62,6,8,26/02/2018 14:26,en-US,,,,,,,,,,2,3,,
2,949AF056-082A-4691-BF29-D7FD158E45AC,Assessment 1,NIH Toolbox Instrumental Support FF Age 18+ v2.0,36,0.143,51,2,8,26/02/2018 14:27,en-US,,,,,,,,,,2,3,,
2,949AF056-082A-4691-BF29-D7FD158E45AC,Assessment 1,NIH Toolbox Friendship FF Age 18+ v2.0,34,0.254,53,2,8,26/02/2018 14:27,en-US,,,,,,,,,,2,3,,
2,949AF056-082A-4691-BF29-D7FD158E45AC,Assessment 1,NIH Toolbox Loneliness FF Age 18+ v2.0,10,0.374,54,3,5,26/02/2018 14:28,en-US,,,,,,,,,,2,3,,
2,949AF056-082A-4691-BF29-D7FD158E45AC,Assessment 1,NIH Toolbox Perceived Rejection FF Age 18+ v2.0,16,0.415,55,2,8,26/02/2018 14:29,en-US,,,,,,,,,,2,3,,
2,949AF056-082A-4691-BF29-D7FD158E45AC,Assessment 1,NIH Toolbox Perceived Hostility FF Age 18+ v2.0,16,0.251,53,2,8,26/02/2018 14:29,en-US,,,,,,,,,,2,3,,
2,949AF056-082A-4691-BF29-D7FD158E45AC,Assessment 1,NIH Toolbox Self-Efficacy CAT Age 18+ v2.0,10,-0.865,41,3,4,26/02/2018 14:30,en-US,,,,,,,,,,2,3,,
2,949AF056-082A-4691-BF29-D7FD158E45AC,Assessment 1,NIH Toolbox Perceived Stress FF Age 18+ v2.0,25,0.113,52,3,10,26/02/2018 14:32,en-US,,,,,,,,,,2,3,,
2,949AF056-082A-4691-BF29-D7FD158E45AC,Assessment 1,NIH Toolbox Fear-Affect CAT Age 18+ v2.0,10,1.053,61,3,4,26/02/2018 14:32,en-US,,,,,,,,,,2,3,,
2,949AF056-082A-4691-BF29-D7FD158E45AC,Assessment 1,NIH Toolbox Fear-Somatic Arousal FF Age 18+ v2.0,9,0.549,56,5,6,26/02/2018 14:33,en-US,,,,,,,,,,2,3,,
2,949AF056-082A-4691-BF29-D7FD158E45AC,Assessment 1,NIH Toolbox Sadness CAT Age 18+ v2.0,6,-0.237,48,3,4,26/02/2018 14:33,en-US,,,,,,,,,,2,3,,
2,949AF056-082A-4691-BF29-D7FD158E45AC,Assessment 1,NIH Toolbox Anger-Affect CAT Age 18+ v2.0,11,-0.284,48,3,6,26/02/2018 14:34,en-US,,,,,,,,,,2,3,,
2,949AF056-082A-4691-BF29-D7FD158E45AC,Assessment 1,NIH Toolbox Anger-Hostility FF Age 18+ v2.0,15,0.742,59,4,5,26/02/2018 14:34,en-US,,,,,,,,,,2,3,,
2,949AF056-082A-4691-BF29-D7FD158E45AC,Assessment 1,NIH Toolbox Anger-Physical Aggression FF Age 18+ v2.0,9,0.862,59,4,5,26/02/2018 14:35,en-US,,,,,,,,,,2,3,,
2,949AF056-082A-4691-BF29-D7FD158E45AC,Assessment 1,NIH Toolbox Words-In-Noise Test Age 6+ v2.1,,,,,14,26/02/2018 14:42,en-US,,,,,,25,6,26,5.2,2,3,,
2,949AF056-082A-4691-BF29-D7FD158E45AC,Assessment 1,Negative Affect Summary (18+),,,54,,,,en-US,,,,,,,,,,,,,
2,949AF056-082A-4691-BF29-D7FD158E45AC,Assessment 1,Social Satisfaction Summary (18+),,,52,,,,en-US,,,,,,,,,,,,,
2,949AF056-082A-4691-BF29-D7FD158E45AC,Assessment 1,Psychological Well Being Summary (18+),,,43,,,,en-US,,,,,,,,,,,,,
2,949AF056-082A-4691-BF29-D7FD158E45AC,Assessment 1,Cognition Early Childhood Composite v1.1,,,,,,,en-US,,108,95,36,,,,,,,,,
2,949AF056-082A-4691-BF29-D7FD158E45AC,Assessment 1,NIH Toolbox Words-In-Noise Test Age 6+ v2.1,,,,,,08/03/2018 19:39,en-US,,,,,,,,,,1,4,3,
2,949AF056-082A-4691-BF29-D7FD158E45AC,Assessment 1,NIH Toolbox List Sorting Working Memory Test Age 7+ v2.1,19,,,,18,08/03/2018 19:46,en-US,,109,194,99,,,,,,2,3,,
2,949AF056-082A-4691-BF29-D7FD158E45AC,Assessment 1,NIH Toolbox Auditory Verbal Learning Test (Rey) 8+ v2.0,24,,,,4,08/03/2018 19:50,en-US,,,,,,,,,,2,3,,
2,949AF056-082A-4691-BF29-D7FD158E45AC,Assessment 1,NIH Toolbox Oral Symbol Digit Test 8+,119,,,,144,08/03/2018 20:01,en-US,,,,,,,,,,2,3,,
3,949AF056-082A-4691-BF29-D7FD158E45AC,Watch-a-movie part 1,NIH Toolbox Picture Vocabulary Test Age 3+ v2.0,,6.669,,0.48,20,27/02/2018 15:41,en-US,,114,123,94,62,,,,,2,3,,
3,949AF056-082A-4691-BF29-D7FD158E45AC,Watch-a-movie part 1,NIH Toolbox List Sorting Working Memory Test Age 7+ v2.1,16,,,,15,27/02/2018 15:49,en-US,,97,86,18,37,,,,,2,3,,
3,949AF056-082A-4691-BF29-D7FD158E45AC,Watch-a-movie part 1,NIH Toolbox Pattern Comparison Processing Speed Test Age 7+ v2.1,49,,,,51,27/02/2018 15:52,en-US,64,111,97,43,47,,,,,2,3,,
3,949AF056-082A-4691-BF29-D7FD158E45AC,Watch-a-movie part 1,NIH Toolbox Picture Sequence Memory Test Age 8+ Form A v2.1,11,-0.99,,0.42,6,27/02/2018 15:59,en-US,485.76,95,89,23,41,,,,,2,3,,
3,949AF056-082A-4691-BF29-D7FD158E45AC,Watch-a-movie part 1,NIH Toolbox Flanker Inhibitory Control and Attention Test Age 12+ v2.1,20,,,,24,27/02/2018 16:02,en-US,9.66,114,115,84,57,,,,,2,3,,
3,949AF056-082A-4691-BF29-D7FD158E45AC,Watch-a-movie part 1,NIH Toolbox Dimensional Change Card Sort Test Age 12+ v2.1,29,,,,38,27/02/2018 16:07,en-US,9.88,119,125,96,63,,,,,2,3,,
3,949AF056-082A-4691-BF29-D7FD158E45AC,Watch-a-movie part 1,NIH Toolbox Oral Symbol Digit Test 8+,79,,,,144,27/02/2018 16:15,en-US,,,,,,,,,,2,3,,
3,949AF056-082A-4691-BF29-D7FD158E45AC,Watch-a-movie part 1,NIH Toolbox Auditory Verbal Learning Test (Rey) 8+ v2.0,31,,,,4,27/02/2018 16:18,en-US,,,,,,,,,,2,3,,
3,949AF056-082A-4691-BF29-D7FD158E45AC,Watch-a-movie part 1,NIH Toolbox Positive Affect CAT Age 18+ v2.0,58,1.614,66,4,12,27/02/2018 16:20,en-US,,,,,,,,,,2,3,,
3,949AF056-082A-4691-BF29-D7FD158E45AC,Watch-a-movie part 1,NIH Toolbox General Life Satisfaction CAT Age 18+ v2.0,24,1.446,65,3,4,27/02/2018 16:20,en-US,,,,,,,,,,2,3,,
3,949AF056-082A-4691-BF29-D7FD158E45AC,Watch-a-movie part 1,NIH Toolbox Meaning and Purpose CAT Age 18+ v2.0,27,0.547,54,3,6,27/02/2018 16:21,en-US,,,,,,,,,,2,3,,
3,949AF056-082A-4691-BF29-D7FD158E45AC,Watch-a-movie part 1,NIH Toolbox Emotional Support FF Age 18+ v2.0,39,0.676,56,3,8,27/02/2018 16:21,en-US,,,,,,,,,,2,3,,
3,949AF056-082A-4691-BF29-D7FD158E45AC,Watch-a-movie part 1,NIH Toolbox Instrumental Support FF Age 18+ v2.0,31,-0.362,46,2,8,27/02/2018 16:23,en-US,,,,,,,,,,2,3,,
3,949AF056-082A-4691-BF29-D7FD158E45AC,Watch-a-movie part 1,NIH Toolbox Friendship FF Age 18+ v2.0,35,0.405,54,3,8,27/02/2018 16:23,en-US,,,,,,,,,,2,3,,
3,949AF056-082A-4691-BF29-D7FD158E45AC,Watch-a-movie part 1,NIH Toolbox Loneliness FF Age 18+ v2.0,11,0.654,57,3,5,27/02/2018 16:24,en-US,,,,,,,,,,2,3,,
3,949AF056-082A-4691-BF29-D7FD158E45AC,Watch-a-movie part 1,NIH Toolbox Perceived Rejection FF Age 18+ v2.0,10,-0.63,44,3,8,27/02/2018 16:24,en-US,,,,,,,,,,2,3,,
3,949AF056-082A-4691-BF29-D7FD158E45AC,Watch-a-movie part 1,NIH Toolbox Perceived Hostility FF Age 18+ v2.0,14,-0.143,49,3,8,27/02/2018 16:25,en-US,,,,,,,,,,2,3,,
3,949AF056-082A-4691-BF29-D7FD158E45AC,Watch-a-movie part 1,NIH Toolbox Self-Efficacy CAT Age 18+ v2.0,38,1.061,60,3,10,27/02/2018 16:25,en-US,,,,,,,,,,2,3,,
3,949AF056-082A-4691-BF29-D7FD158E45AC,Watch-a-movie part 1,NIH Toolbox Perceived Stress FF Age 18+ v2.0,23,-0.53,45,4,10,27/02/2018 16:26,en-US,,,,,,,,,,2,3,,
3,949AF056-082A-4691-BF29-D7FD158E45AC,Watch-a-movie part 1,NIH Toolbox Fear-Affect CAT Age 18+ v2.0,8,0.618,56,3,4,27/02/2018 16:27,en-US,,,,,,,,,,2,3,,
3,949AF056-082A-4691-BF29-D7FD158E45AC,Watch-a-movie part 1,NIH Toolbox Fear-Somatic Arousal FF Age 18+ v2.0,13,1.05,62,5,6,27/02/2018 16:27,en-US,,,,,,,,,,2,3,,
3,949AF056-082A-4691-BF29-D7FD158E45AC,Watch-a-movie part 1,NIH Toolbox Sadness CAT Age 18+ v2.0,9,-0.715,41,3,7,27/02/2018 16:27,en-US,,,,,,,,,,2,3,,
3,949AF056-082A-4691-BF29-D7FD158E45AC,Watch-a-movie part 1,NIH Toolbox Anger-Affect CAT Age 18+ v2.0,13,-0.759,43,3,8,27/02/2018 16:28,en-US,,,,,,,,,,2,3,,
3,949AF056-082A-4691-BF29-D7FD158E45AC,Watch-a-movie part 1,NIH Toolbox Anger-Hostility FF Age 18+ v2.0,7,-0.396,46,4,5,27/02/2018 16:28,en-US,,,,,,,,,,2,3,,
3,949AF056-082A-4691-BF29-D7FD158E45AC,Watch-a-movie part 1,NIH Toolbox Anger-Physical Aggression FF Age 18+ v2.0,19,1.513,67,4,5,27/02/2018 16:29,en-US,,,,,,,,,,2,3,,
3,949AF056-082A-4691-BF29-D7FD158E45AC,Watch-a-movie part 1,NIH Toolbox Words-In-Noise Test Age 6+ v2.1,,,,,13,27/02/2018 16:35,en-US,,,,,,23,7.6,28,3.6,2,3,,
3,949AF056-082A-4691-BF29-D7FD158E45AC,Watch-a-movie part 1,Negative Affect Summary (18+),,,46,,,,en-US,,,,,,,,,,,,,
3,949AF056-082A-4691-BF29-D7FD158E45AC,Watch-a-movie part 1,Social Satisfaction Summary (18+),,,51,,,,en-US,,,,,,,,,,,,,
3,949AF056-082A-4691-BF29-D7FD158E45AC,Watch-a-movie part 1,Psychological Well Being Summary (18+),,,63,,,,en-US,,,,,,,,,,,,,
3,949AF056-082A-4691-BF29-D7FD158E45AC,Watch-a-movie part 1,Cognition Fluid Composite v1.1,,,,,,,en-US,,109,103,59,48,,,,,,,,
3,949AF056-082A-4691-BF29-D7FD158E45AC,Watch-a-movie part 1,Cognition Early Childhood Composite v1.1,,,,,,,en-US,,114,118,89,58,,,,,,,,
4,949AF056-082A-4691-BF29-D7FD158E45AC,Assessment 1,NIH Toolbox Picture Vocabulary Test Age 3+ v2.0,,4.99,,0.502,30,02/03/2018 17:20,en-US,,106,112,78,51,,,,,2,3,,
4,949AF056-082A-4691-BF29-D7FD158E45AC,Assessment 1,NIH Toolbox List Sorting Working Memory Test Age 7+ v2.1,19,,,,21,02/03/2018 17:30,en-US,,109,102,56,48,,,,,2,3,,
4,949AF056-082A-4691-BF29-D7FD158E45AC,Assessment 1,NIH Toolbox Pattern Comparison Processing Speed Test Age 7+ v2.1,49,,,,50,02/03/2018 17:34,en-US,64,111,97,43,47,,,,,2,3,,
4,949AF056-082A-4691-BF29-D7FD158E45AC,Assessment 1,NIH Toolbox Picture Sequence Memory Test Age 8+ Form A v2.1,11,-0.48,,0.35,6,02/03/2018 17:42,en-US,536.95,103,94,35,46,,,,,2,3,,
4,949AF056-082A-4691-BF29-D7FD158E45AC,Assessment 1,NIH Toolbox Flanker Inhibitory Control and Attention Test Age 12+ v2.1,20,,,,24,02/03/2018 17:45,en-US,8.81,105,93,31,43,,,,,2,3,,
4,949AF056-082A-4691-BF29-D7FD158E45AC,Assessment 1,NIH Toolbox Dimensional Change Card Sort Test Age 12+ v2.1,28,,,,38,02/03/2018 17:50,en-US,7.29,96,74,4,31,,,,,2,3,,
4,949AF056-082A-4691-BF29-D7FD158E45AC,Assessment 1,NIH Toolbox Oral Symbol Digit Test 8+,65,,,,144,02/03/2018 17:54,en-US,,,,,,,,,,2,3,,
4,949AF056-082A-4691-BF29-D7FD158E45AC,Assessment 1,NIH Toolbox Auditory Verbal Learning Test (Rey) 8+ v2.0,33,,,,4,02/03/2018 17:57,en-US,,,,,,,,,,2,3,,
4,949AF056-082A-4691-BF29-D7FD158E45AC,Assessment 1,NIH Toolbox Positive Affect CAT Age 18+ v2.0,55,1.194,61,3,12,02/03/2018 17:58,en-US,,,,,,,,,,2,3,,
4,949AF056-082A-4691-BF29-D7FD158E45AC,Assessment 1,NIH Toolbox General Life Satisfaction CAT Age 18+ v2.0,22,-0.378,45,3,6,02/03/2018 17:59,en-US,,,,,,,,,,2,3,,
4,949AF056-082A-4691-BF29-D7FD158E45AC,Assessment 1,NIH Toolbox Meaning and Purpose CAT Age 18+ v2.0,20,-0.005,49,3,5,02/03/2018 18:00,en-US,,,,,,,,,,2,3,,
4,949AF056-082A-4691-BF29-D7FD158E45AC,Assessment 1,NIH Toolbox Emotional Support FF Age 18+ v2.0,37,0.302,52,3,8,02/03/2018 18:00,en-US,,,,,,,,,,2,3,,
4,949AF056-082A-4691-BF29-D7FD158E45AC,Assessment 1,NIH Toolbox Instrumental Support FF Age 18+ v2.0,17,-1.6,33,2,8,02/03/2018 18:01,en-US,,,,,,,,,,2,3,,
4,949AF056-082A-4691-BF29-D7FD158E45AC,Assessment 1,NIH Toolbox Friendship FF Age 18+ v2.0,39,1.198,62,4,8,02/03/2018 18:02,en-US,,,,,,,,,,2,3,,
4,949AF056-082A-4691-BF29-D7FD158E45AC,Assessment 1,NIH Toolbox Loneliness FF Age 18+ v2.0,9,0.267,53,3,5,02/03/2018 18:02,en-US,,,,,,,,,,2,3,,
4,949AF056-082A-4691-BF29-D7FD158E45AC,Assessment 1,NIH Toolbox Perceived Rejection FF Age 18+ v2.0,10,-0.601,44,3,8,02/03/2018 18:03,en-US,,,,,,,,,,2,3,,
4,949AF056-082A-4691-BF29-D7FD158E45AC,Assessment 1,NIH Toolbox Perceived Hostility FF Age 18+ v2.0,27,1.898,70,3,8,02/03/2018 18:04,en-US,,,,,,,,,,2,3,,
4,949AF056-082A-4691-BF29-D7FD158E45AC,Assessment 1,NIH Toolbox Self-Efficacy CAT Age 18+ v2.0,23,0.263,52,3,7,02/03/2018 18:04,en-US,,,,,,,,,,2,3,,
4,949AF056-082A-4691-BF29-D7FD158E45AC,Assessment 1,NIH Toolbox Perceived Stress FF Age 18+ v2.0,27,0.587,57,4,10,02/03/2018 18:06,en-US,,,,,,,,,,2,3,,
4,949AF056-082A-4691-BF29-D7FD158E45AC,Assessment 1,NIH Toolbox Fear-Affect CAT Age 18+ v2.0,8,0.58,55,3,4,02/03/2018 18:06,en-US,,,,,,,,,,2,3,,
4,949AF056-082A-4691-BF29-D7FD158E45AC,Assessment 1,NIH Toolbox Fear-Somatic Arousal FF Age 18+ v2.0,15,1.593,68,5,6,02/03/2018 18:07,en-US,,,,,,,,,,2,3,,
4,949AF056-082A-4691-BF29-D7FD158E45AC,Assessment 1,NIH Toolbox Sadness CAT Age 18+ v2.0,9,0.498,57,3,4,02/03/2018 18:07,en-US,,,,,,,,,,2,3,,
4,949AF056-082A-4691-BF29-D7FD158E45AC,Assessment 1,NIH Toolbox Anger-Affect CAT Age 18+ v2.0,14,-0.44,46,3,8,02/03/2018 18:08,en-US,,,,,,,,,,2,3,,
4,949AF056-082A-4691-BF29-D7FD158E45AC,Assessment 1,NIH Toolbox Anger-Hostility FF Age 18+ v2.0,10,0.345,54,4,5,02/03/2018 18:09,en-US,,,,,,,,,,2,3,,
4,949AF056-082A-4691-BF29-D7FD158E45AC,Assessment 1,NIH Toolbox Anger-Physical Aggression FF Age 18+ v2.0,6,0.123,51,5,5,02/03/2018 18:09,en-US,,,,,,,,,,2,3,,
4,949AF056-082A-4691-BF29-D7FD158E45AC,Assessment 1,NIH Toolbox Words-In-Noise Test Age 6+ v2.1,,,,,14,02/03/2018 18:16,en-US,,,,,,27,4.4,23,7.6,2,3,,
4,949AF056-082A-4691-BF29-D7FD158E45AC,Assessment 1,Negative Affect Summary (18+),,,55,,,,en-US,,,,,,,,,,,,,
4,949AF056-082A-4691-BF29-D7FD158E45AC,Assessment 1,Social Satisfaction Summary (18+),,,51,,,,en-US,,,,,,,,,,,,,
4,949AF056-082A-4691-BF29-D7FD158E45AC,Assessment 1,Psychological Well Being Summary (18+),,,53,,,,en-US,,,,,,,,,,,,,
4,949AF056-082A-4691-BF29-D7FD158E45AC,Assessment 1,Cognition Fluid Composite v1.1,,,,,,,en-US,,106,88,21,39,,,,,,,,
4,949AF056-082A-4691-BF29-D7FD158E45AC,Assessment 1,Cognition Early Childhood Composite v1.1,,,,,,,en-US,,103,90,25,39,,,,,,,,
5,949AF056-082A-4691-BF29-D7FD158E45AC,Assessment 1,NIH Toolbox Picture Vocabulary Test Age 3+ v2.0,,5.924,,0.489,27,16/03/2018 17:18,en-US,,110,118,89,60,,,,,2,3,,
5,949AF056-082A-4691-BF29-D7FD158E45AC,Assessment 1,NIH Toolbox List Sorting Working Memory Test Age 7+ v2.1,20,,,,17,16/03/2018 17:37,en-US,,113,107,69,51,,,,,2,3,,
5,949AF056-082A-4691-BF29-D7FD158E45AC,Assessment 1,NIH Toolbox Pattern Comparison Processing Speed Test Age 7+ v2.1,64,,,,64,16/03/2018 17:40,en-US,89,143,136,99,73,,,,,2,3,,
5,949AF056-082A-4691-BF29-D7FD158E45AC,Assessment 1,NIH Toolbox Picture Sequence Memory Test Age 8+ Form A v2.1,23,0.87,,0.42,6,16/03/2018 17:48,en-US,672.13,125,115,84,57,,,,,2,3,,
5,949AF056-082A-4691-BF29-D7FD158E45AC,Assessment 1,NIH Toolbox Flanker Inhibitory Control and Attention Test Age 12+ v2.1,20,,,,24,16/03/2018 17:51,en-US,8.96,107,92,30,46,,,,,2,3,,
5,949AF056-082A-4691-BF29-D7FD158E45AC,Assessment 1,NIH Toolbox Dimensional Change Card Sort Test Age 12+ v2.1,28,,,,38,16/03/2018 17:56,en-US,9.28,114,108,70,54,,,,,2,3,,
5,949AF056-082A-4691-BF29-D7FD158E45AC,Assessment 1,NIH Toolbox Oral Symbol Digit Test 8+,95,,,,144,16/03/2018 18:01,en-US,,,,,,,,,,2,3,,
5,949AF056-082A-4691-BF29-D7FD158E45AC,Assessment 1,NIH Toolbox Auditory Verbal Learning Test (Rey) 8+ v2.0,33,,,,4,16/03/2018 18:04,en-US,,,,,,,,,,2,3,,
5,949AF056-082A-4691-BF29-D7FD158E45AC,Assessment 1,NIH Toolbox Positive Affect CAT Age 18+ v2.0,9,-1.378,36,3,4,16/03/2018 18:05,en-US,,,,,,,,,,2,3,,
5,949AF056-082A-4691-BF29-D7FD158E45AC,Assessment 1,NIH Toolbox General Life Satisfaction CAT Age 18+ v2.0,15,-0.382,45,3,4,16/03/2018 18:06,en-US,,,,,,,,,,2,3,,
5,949AF056-082A-4691-BF29-D7FD158E45AC,Assessment 1,NIH Toolbox Meaning and Purpose CAT Age 18+ v2.0,15,-0.967,39,3,5,16/03/2018 18:06,en-US,,,,,,,,,,2,3,,
5,949AF056-082A-4691-BF29-D7FD158E45AC,Assessment 1,NIH Toolbox Emotional Support FF Age 18+ v2.0,29,-0.856,40,2,8,16/03/2018 18:07,en-US,,,,,,,,,,2,3,,
5,949AF056-082A-4691-BF29-D7FD158E45AC,Assessment 1,NIH Toolbox Instrumental Support FF Age 18+ v2.0,23,-1.072,38,2,8,16/03/2018 18:07,en-US,,,,,,,,,,2,3,,
5,949AF056-082A-4691-BF29-D7FD158E45AC,Assessment 1,NIH Toolbox Friendship FF Age 18+ v2.0,27,-0.521,44,2,8,16/03/2018 18:08,en-US,,,,,,,,,,2,3,,
5,949AF056-082A-4691-BF29-D7FD158E45AC,Assessment 1,NIH Toolbox Loneliness FF Age 18+ v2.0,14,1.145,63,3,5,16/03/2018 18:08,en-US,,,,,,,,,,2,3,,
5,949AF056-082A-4691-BF29-D7FD158E45AC,Assessment 1,NIH Toolbox Perceived Rejection FF Age 18+ v2.0,16,0.433,55,2,8,16/03/2018 18:09,en-US,,,,,,,,,,2,3,,
5,949AF056-082A-4691-BF29-D7FD158E45AC,Assessment 1,NIH Toolbox Perceived Hostility FF Age 18+ v2.0,9,-1.179,38,4,8,16/03/2018 18:09,en-US,,,,,,,,,,2,3,,
5,949AF056-082A-4691-BF29-D7FD158E45AC,Assessment 1,NIH Toolbox Self-Efficacy CAT Age 18+ v2.0,12,-1.06,39,3,5,16/03/2018 18:10,en-US,,,,,,,,,,2,3,,
5,949AF056-082A-4691-BF29-D7FD158E45AC,Assessment 1,NIH Toolbox Perceived Stress FF Age 18+ v2.0,32,1.316,64,4,10,16/03/2018 18:10,en-US,,,,,,,,,,2,3,,
5,949AF056-082A-4691-BF29-D7FD158E45AC,Assessment 1,NIH Toolbox Fear-Affect CAT Age 18+ v2.0,14,1.798,70,3,4,16/03/2018 18:11,en-US,,,,,,,,,,2,3,,
5,949AF056-082A-4691-BF29-D7FD158E45AC,Assessment 1,NIH Toolbox Fear-Somatic Arousal FF Age 18+ v2.0,9,0.526,56,5,6,16/03/2018 18:11,en-US,,,,,,,,,,2,3,,
5,949AF056-082A-4691-BF29-D7FD158E45AC,Assessment 1,NIH Toolbox Sadness CAT Age 18+ v2.0,8,0.5,57,2,4,16/03/2018 18:11,en-US,,,,,,,,,,2,3,,
5,949AF056-082A-4691-BF29-D7FD158E45AC,Assessment 1,NIH Toolbox Anger-Affect CAT Age 18+ v2.0,13,-0.341,47,3,7,16/03/2018 18:12,en-US,,,,,,,,,,2,3,,
5,949AF056-082A-4691-BF29-D7FD158E45AC,Assessment 1,NIH Toolbox Anger-Hostility FF Age 18+ v2.0,19,1.264,64,4,5,16/03/2018 18:12,en-US,,,,,,,,,,2,3,,
5,949AF056-082A-4691-BF29-D7FD158E45AC,Assessment 1,NIH Toolbox Anger-Physical Aggression FF Age 18+ v2.0,5,-0.661,42,7,5,16/03/2018 18:12,en-US,,,,,,,,,,2,3,,
5,949AF056-082A-4691-BF29-D7FD158E45AC,Assessment 1,NIH Toolbox Words-In-Noise Test Age 6+ v2.1,,,,,13,16/03/2018 18:19,en-US,,,,,,17,12.4,24,6.8,2,3,,
5,949AF056-082A-4691-BF29-D7FD158E45AC,Assessment 1,Negative Affect Summary (18+),,,63,,,,en-US,,,,,,,,,,,,,
5,949AF056-082A-4691-BF29-D7FD158E45AC,Assessment 1,Social Satisfaction Summary (18+),,,39,,,,en-US,,,,,,,,,,,,,
5,949AF056-082A-4691-BF29-D7FD158E45AC,Assessment 1,Psychological Well Being Summary (18+),,,38,,,,en-US,,,,,,,,,,,,,
5,949AF056-082A-4691-BF29-D7FD158E45AC,Assessment 1,Cognition Fluid Composite v1.1,,,,,,,en-US,,127,117,87,59,,,,,,,,